##TITLE= 30torr
##JCAMP-DX= 4.24  $$a comment
##ORIGIN= PERKIN-ELMER 1600 FT-IR
##DATA TYPE= INFRARED SPECTRUM
##$ASDF FORM= DUP
##DATE= 96/06/14
##TIME= 09:33:22
##OWNER= svbch4
##ORIGIN= 
##SPECTROMETER/DATA SYSTEM= PERKIN-ELMER 1600 FTIR
##INSTRUMENT PARAMETERS= 
svbch4: 4400.0,450.00 cm-1; -0.28,0.31 A        96/06/14 09:33
   256 scans; mode ratio; resol 4.00 cm-1; apod strong
##DATA PROCESSING= 
##XUNITS= 1/CM
##YUNITS= ABSORBANCE
##XFACTOR= 1.
##YFACTOR= 0.00028
##FIRSTX= 4400.
##LASTX= 450.
##NPOINTS= 1976
##MAXY= 1
##MINY= -0.01
##FIRSTY= 0.0079
##XYDATA= (X++(Y..Y))
$$ plain form
4400 79 74 91 120 110 82 60 69 83 97 113 113 99 84 70 78 107 118 107 105 109 119 122 108 113 131 135 118 105 112 123 111 98 89 76 57 43 36 35 31 49
4320 49 130 235 258 208 154 116 91 77 73 74 71 76 83 73 78 85 83 87 94 93 100 118 147 154 134 123 130 137 146 159 164 164 164 143 125 121 133 137 133 138 109 84 78 66
4232 66 61 68 84 106 122 213 330 327 234 158 127 128 111 83 81 78 75 88 88 85 93 81 72 85 91 82 81 88 98 90 74 68 66 61 63 68 69 62 59 61 58 43 32 31 36 43
4140 43 49 47 43 38 35 37 43 48 50 51 44 37 31 30 31 34 37 42 39 33 30 30 29 30 29 29 31 30 29 29 29 27 27 25 26 27 26 22 23 25 25 23 23 23 25 22 22 23 23 21 21 22 22 21 21 22 25 24 21 22 23 22 21 22 23 24
4008 24 21 21 20 20 20 21 22 24 25 23 22 23 24 22 24 27 28 28 27 24 23 24 27 27 27 27 27 29 35 35 32 33 34 28 24 24 30 38 40 35 36 39 35 34 38 36 30 28 29 36 47 58 58 59 56 48 47 54 48 42 44 46 48 46 36
3878 36 36 43 52 55 51 61 76 69 55 53 57 68 66 50 37 37 44 52 59 60 50 43 37 37 42 46 47 54 59 54 45 31 24 25 32 35 39 50 54 48 39 27 23 21 25 33 35 31 32 30 24 21 26 33
3770 33 33 33 30 29 35 41 41 47 62 71 65 65 61 55 54 60 73 78 62 53 55 63 63 57 47 39 35 41 59 64 49 40 39 39 36 33 34 37 47 57 48 34 29 28 33 43 59 55 48 48 35 22 19
3664 19 19 21 26 29 28 35 54 63 48 35 30 28 27 27 31 37 52 56 43 33 34 42 48 47 49 43 38 39 34 29 35 43 42 40 36 30 30 43 43 31 23 21 21 21 18 16 23 41 51 40 27 19
$$ packed form
4400G9nJ7K9j0k8k2RJ4TJ6%j4j5j4QK9J1j1kMJ0Lj4NJ8Mj7j3PJ1j2j3rj3j9j4pjmJ8
4320D9Q1J05K3n0n4l8k5j4mJlNPj0NPkMPjPJ8K9Pk0j1PTRJ3N%Tk1j8mJ2MmNk9k5oj2
4232F6nPJ6K2J6R1J17lr3p6l1Jj7k8klTJ3%lQj2rJ3OrjPJ0qj6oknKNJplKlj5j1jNP
4140D3OkmnlKONKJpTojJLTNlol%jJj%KjT%Tk%kJTjmJK%k%TKl%J%k%J%j%JLjlJTjTJU
4008B4l%j%TJTKJkjJTkKLJ%jljJL%VKO%lJTom%OQKnJLmjMkokJPJ1T%JlqjPoTKUkj0
3878C6%PRLmJ0J5pj4kMJ1kj6j3%PQPJj0po%NMJPNnrj4pJPLMJ1Morj2mkMQKmJkolNP
3770C3%TljOT%OJ5Ro%mojOJ3Nj6rKQ%oj0qmOJ8Nj5rj%lTJLJ0Trj4njNJ0J6mp%j3Tl
3664A9%KNLjPJ9Rj5j3nkj%MOJ5Mj3j0JQOjKonJnTOQjkmo%J3%j2qk%TlkPJ8J0j1j3q
$$ plain form
3560 19 12 10 16 20 17 21 30 28 16 8 9 9 6 7 15 22 24 24 18 9 5 1 2 6 12 10 9 16 17 9 4 4 2 -1 1 4 3 4 7 4 -1 -2 -1 -2 -2 -1 -2 -1 0 -1 -4 -4 -5 -7 -4 3 5 3 1 -2 -5 -5 -5
3434 -5 -4 -5 -5 -4 -3 0 0 -3 -5 -6 -6 -7 -7 -7 -6 -6 -5 -4 -3 -2 -2 -4 -5 -2 -2 -4 -5 -7 -6 -5 -4 -2 0 1 1 -1 -2 -1 0 -2 -4 -3 -3 -4 -3 -3 -2 0 2 2 1 0 0 2 1 0 1 2 2 4 4 4 4 4 3 2 3 4 4 5 6
3292 6 6 5 5 6 6 5 6 8 8 6 5 5 5 5 5 4 5 6 8 7 7 7 7 7 7 7 7 9 9 9 9 9 8 9 10 11 13 13 13 11 13 15 13 11 15 22 21 16 20 31 29 17 22 46 51 28 29 72 90 50 28 84 142 97
3164 97 36 81 185 161 66 69 216 259 131 61 185 339 226 86 117 298 300 137 89 229 348 218 88 155 364 346 157
3110 157 96 263 408 252 95 141 380 391 176 97 239 456 331 130 116 286 383 218 99 147 320 318 137 61 146
3060 146 299 246 96 49 119 197 135 60 49 99 136 83 45 49 105 130 88 93 253 856 2191 3105 2542 1654 1080 786 525
3006 525 285 171 192 186 101 47 77 250 304 143 54 100 302 373 181 68 87 260 377 237 95 84 312 512 323
2956 323 139 104 281 515 374 149 78 195 433 371 163 90 158 415 431 182 83 155 383 440 210 77 101 243 339
$$ packed form
3560A9pkOMlMRkj2qJ%lJQPK%ormTJMOkjPJqn%klKLjJLlnjJj%JjJTjl%jkLPKkTlT%T
3434eJj%JTL%lkj%j%TJ%JV%kjL%kjkJUKTJ%kjJTkTJ%jJ%JKT%jT%KjTJT%K%VjTJT%JT
3292F%j%J%jJK%kj%VjJTKj%YK%VjJUK%TkKTkTMPjnMJ1kj2NK4Nk3JM3J8m0k2N6N8m5
3164I7o1M5J04k4r5LJ47M3j28p0J24J54j13j40L1J81Kj63m8J40J19j30TO7K09j8j89
3110A57o1J67J45j56j57M6K39J1k15p9J42K17j25k01j4J70R7j65j19M8J73kj81p6Q5
3060A46J53n3j50m7P0P8o2p5j1N0L7n3l8MN6K5m2NJ60O03J335R14n63q88n74k94k61
3006E25k40j14K1oq5n4L0J73N4j61q9M6K02P1j92j13J9J73J17j40j42j1K28K00j89
2956C23j84l5J77K34j41k25p1J17K38o2k08p3O8K57J6k49r9P2K28N7k30j33K4J42R6
$$ plain form
2906 339 214 105 104 189 309 246 93 46 117 251 244 117 68 108 187 200 122 74 90 138 155 113 64 56 72 91 72 46 44 43 44 46
2842 46 40 34 46 59 67 89 108 116 126 122 105 83 62 55 51 47 46 58 73 63 61 56 46 57 70 76 76 63 52 44 37 36 38 59 77 63 42 28 23 26 36 57
2758 57 56 33 26 30 28 26 49 84 68 33 22 18 16 22 53 70 43 20 16 17 19 35 60 48 23 18 20 19 21 37 49 38 27 22 15 17 29 38 34 27 21 17 19 23 25 24
2666 24 21 15 14 18 23 20 19 21 20 18 18 20 21 22 22 23 23 20 17 15 14 13 16 19 17 12 6 5 7 10 16 23 32 32 21 14 12 12 13 14 16 15 13 13 12 13 15 18 18 13 13 17 20 22 20 14 12 11 15 18 15 11 10
2540 10 14 15 12 11 13 16 16 13 10 9 11 15 19 18 13 8 8 10 10 9 10 17 21 15 10 8 8 8 9 11 14 14 14 13 10 9 10 9 10 11 10 8 10 13 12 10 9 10 12 11 8 7 8 11 14 12 10 10 9 7 7 8 9 9
2412 9 10 11 11 9 8 7 7 8 8 9 9 11 17 25 36 45 53 60 69 80 94 110 124 135 142 147 149 142 133 123 110 104 114 127 123 115 109 107 107 112 112 106 100 102 100 93 82 73 71 70 68 63 57 50
2304 50 45 42 39 34 31 27 22 18 14 12 11 13 14 14 14 14 14 13 13 13 12 11 11 11 10 9 9 9 9 8 8 8 7 7 7 7 7 6 6 6 6 6 6 6 6 6 6 6 7 7 6 7 7 7 6 7 6 6 7 7 7 6 5 5 6 6 6 6 6 7 7 6 7 7 7 6 6 5
2148 5 6 6 6 6 6 7 7 7 7 7 6 6 5 5 5 5 6 6 5 5 5 5 5 6 6 6 6 6 8 8 6 6 6 5 5 6 7 5 4 5 9 9 7 6 6 6 6 6 6 5 6 7 9 8 6 6 6 5 5 5 5 5 6 8 12 11 7 5 6 6 5 5 5 7 6 5 9 14 12 10
$$ packed form
2906C39j25j09jQ5J20o3j53m7P1J34pj27m9M0P9J3p8m8J6M8J7m2m9qJ6J9j9k6kjJK
2842D6oTJ2J3QK2J9QJ0mj7k2k1pmTjJ2J5j0knj0J1J3O%j3j1qpjKK1J8j4k1j4nLJ0K1
2758E7jk3pMkTK3L5j6l5j1mkOL1J7k7k3mJKJ6K5j2k5nKjKJ6J2j1TnpKJ2RmpomKMKj
2666B4lojMNljKjk%KJT%J%lTkjTLTknojKLOPR%j1pk%JTKjk%jJKL%n%MLKkokjMLlmj
2540A0MJljKL%lTjKMTjnT%K%jJPMonk%TJKL%TjljJjJTjkKLjkjJKjljJLTkT%jk%JT%
2412IJT%kjT%J%J%KOQJ1RQPRJ1J4J6J4J1PNKprj0j3oJ0J3mqok%N%oTKkpj1rkjknop
2304E0nlTnlmnmTkjKJ%Vj%TjT%TjT%Uj%Tj%Vj%S0J%jJ%TjJj%J%TjT%J%VJ%jJ%Tj%j
2148EJ%VJ%Vj%j%UJ%j%VJ%VK%k%Tj%JTkjJM%kj%WjJTKjk%Tj%VJKMjmkJ%j%TKjTMNkT
$$ plain form
1988 10 7 5 5 5 5 6 6 6 7 12 13 8 6 6 6 7 7 5 5 7 11 15 17 9 5 4 6 6 5 5 7 14 17 13 12 10 7 9 14 15 10 8 7 6 6 10 12 10 11 10 8 9 6 5 5 5 5 9 21 31 21 10
1864 10 8 10 10 7 5 5 8 16 24 27 18 9 11 13 10 12 22 20 17 16 11 8 9 8 9 15 16 14 12 12 17 20 20 25 27 29 21 13 11 13 18 23 18 17 23 32 27 20 13 12 17 17 17 15 14 24 41 46 40 33 25
1742 25 22 23 24 38 36 28 14 8 11 14 17 35 47 34 21 17 21 29 30 30 39 45 39 21 16 23 29 32 45 37 31 22 18 17 21 29 24 13 13 16 9 9 20 37 30 21 32 40 24 15 18 28
1638 28 35 23 12 11 16 19 26 30 21 20 20 14 16 25 23 15 14 17 14 11 13 13 12 13 12 8 6 6 8 20 30 17 14 24 24 20 22 23 43 63 47 40 38 45 44 50 85 118 127 94 75 62
1534 62 35 25 31 42 47 55 45 45 45 32 32 53 85 65 28 24 25 27 24 17 24 44 41 25 20 20 14 15 37 63 50 19 19 37 34 19 28 56 57 35 28 40 48 26
1446 26 21 32 35 31 40 43 35 28 29 41 43 31 38 51 33 25 32 29 21 27 29 22 27 45 51 48 39 41 56 70 79 91 110 132 159 205 189 205 244 252 255 275 311 335 425
1356 425 423 413 341 417 428 408 569 454 421 342 325 392 249 293 278 168 182 131 103 95 72 102 84 472 1689 2031 1283 777
1300 777 616 541 446 307 286 340 233 273 325 186 194 268 210 235 332 321 256 238 303 311 177 187 258 171 163 268 264 197 186 160 196
$$ packed form
1988A0lk%UJ%TJNJnk%TJ%k%KMTKqmjK%j%KPLmjklKNJnkjT%MKkJjkJlj%UMJ2J0j0j1
1864A0kK%lk%LQTLrTKTlKJ0kljnlJjJOJkT%NL%NKTqTkKNTnjORnpTjN%TkjJ0J7Nopq
1742B5lJTJ4kqj4oLUJ8J2j3TmMQJ%ROoj8nPOLJ3qormjMQnj1%Lp%J1J7prJ1Qj6rLJ0
1638B8Pj2j1jNLPMrj%oKRkqjLlTK%jJjmk%KJ2J0j3lJ0%mKJK0Tj6pkPjOL5L3Rl3j9j3
1534F2k7j0OJ1NQj0%Tj3%K1L2k0l7mJKlpPK0lj6n%oJK2K6j3l1%J8lj5RK8Jk2pJ2Qk2
1446B6nJ1LmRLqpJJ2Kj2PJ3j8qPlqOKpNJ8OlrKJ5J4RJ2J9K2K7M6j6J6L9QLK0L6K4R0
1356D25kj0p2P6J1k0J61j15l3p9j7O7j43M4j5j10J4n1k8qk3L0j8L88J217L42p48n06
1300G77j61p5r5j39k1N4j07M0N2j39QP4n8K5R7j1o5j8O5Qj34J0P1q7qJ05mo7j1k6L6
$$ plain form
1238 196 211 103 80 146 120 71 100 122 115 96 64 41 69 74 32 14 27 38 28 19 15 18 29 28 12 7 7 10 9 7 4 4 4 5 3 2 1 2 4 2 2 2 2 2 2 0
1146 0 0 0 1 1 2 0 -1 -2 -2 -2 -2 -2 -2 -2 -1 -2 -3 -4 -5 -3 -3 -2 -2 -1 -2 -1 -1 1 -1 0 -2 -1 -3 -1 -2 -1 -3 -1 -2 -1 -1 0 -2 -3 -3 -3 -4 -3 -1 0 -1 -3 -2 -4 -4 -4 -1 -2 0 -2 -2 -6 -5 -5 -4 -2 1 1 2 3 3
1004 3 2 2 3 3 2 2 1 1 2 2 2 2 2 0 1 0 1 1 2 1 1 0 1 2 2 2 2 1 1 1 0 0 0 0 1 2 1 1 1 2 1 2 1 2 1 1 0 1 0 1 1 0 -1 0 0 0 0 -1 -1 -1 -2 -2 -1 -1 0 -1 -1 -3 -2 -4
864 -4 -3 -2 -1 -2 0 0 0 -2 -3 -2 -1 0 -1 -1 0 -1 -3 -2 -4 -3 -3 -3 -6 -4 -7 -7 -7 -2 -5 -2 -6 -8 -13 -9 -8 -10 -11 -7 -4 -4 -5 -4 -4 -5 -4 -5 -4 -4 -2 -2 -2 -2 -1 -4 -2 -4 -1 -1 -2 -3 0 0 0 0 1 0 -1 -1 -3 -2
724 -2 3 9 4 -2 -2 3 2 2 1 6 5 8 7 13 15 19 20 24 22 24 25 26 23 21 22 28 58 67 23 12 17 21 28 25 28 25 27 22 20 14 15 13 15 13 14 7 5 4 1 -3 -5 0 10 11 3 4 5 9 4 9 9 17
600 17 7 9 8 26 15 15 7 2 -2 12 12 16 4 4 9 12 6 10 33 30 14 -3 16 22 44 24 17 -23 16 -1 47 30 75 38 -13 -61 6 -34 -41 2 58
518 58 -10 41 94 -45 -176 -129 234 354 448 256 742 91 660 -378 666 649 464 -160 -2284 -125 611 -581
474 -581 -493 -702 -804 250 -2767 449 -375 -701 819 -1612 -767 -48
$$ packed form
1238A96J5j08k3O6k6m9K9K2pj9l2k3K8Nm2j8J3J1j0rmLJ1jj6n%Ljkl%TJkjTJKk%Wk
1146@%TJ%JkjT%XJjVK%J%JjJ%KkJkJkKjJkKjJ%Jkj%TjJKJjkJk%TLjKk%mJ%JKL%JT%
1004Cj%J%j%j%J%VkJjJ%Jj%jJT%Uj%Tj%UJTj%TJjJjJj%jJjJ%jTJ%Uj%Tj%J%Jj%kJk
864dJUjK%TkjJUj%JjkJkJ%TlKl%TNlLmknMJkjML%jJ%jJjJ%K%UJlKkL%jTL%UJjT%kJ
724bNOno%Nj%jNjLjOKMJMkKJTlkJOL0Rm4j1NMPlLlKnkoJkKkJpkjlmkNJ0JqJTMnN%Q
600A7j0KjJ8j1%qnmJ4%Mj2%NLoMK3lj6j7J9OK2k0pm0L9j7M8j7M5l7n1m8O7m0pM3N6
518E8o8N1N3j39j31M7L63J20R4j92M86o51N69j038J044j7j85o24k124K159P36j192
474e81Q8k09j02J054l017L216q24l26J520k431Q45P19
450d8
##END=
