##TITLE= hcl
##JCAMP-DX= 4.24  $$a comment
##ORIGIN= PERKIN-ELMER 1600 FT-IR
##DATA TYPE= INFRARED SPECTRUM
##$ASDF FORM= DUP
##DATE= 96/03/18
##TIME= 15:02:01
##OWNER= Scott Van Bramer
##JCAMP-DX= 4.24   $$ a comment
##ORIGIN= Perkin-Elmer 1600 FT-IR
##DATA TYPE= INFRARED SPECTRUM
##$ASDF FORM= DUP
##SPECTROMETER/DATA SYSTEM= PERKIN-ELMER 1600 FTIR
##INSTRUMENT PARAMETERS= 
X: 4400.0,450.00 cm-1; -0.28,0.27 A             96/03/18 15:02
   64 scans; mode ratio; resol 4.00 cm-1; apod strong
##DATA PROCESSING= 
##XUNITS= 1/CM
##YUNITS= ABSORBANCE
##XFACTOR= 1.
##YFACTOR= 0.001
##FIRSTX= 4400.
##LASTX= 450.
##NPOINTS= 1976
##MAXY= 1
##MINY= -0.02
##FIRSTY= -0.0059
##XYDATA= (X++(Y..Y))
$$ plain form
4400 -59 -60 -62 -61 -63 -61 -58 -58 -60 -62 -61 -59 -61 -65 -64 -63 -62 -58 -60 -64 -60 -58 -58 -59 -62 -64 -63 -61 -57 -56 -59 -62 -64 -63 -58 -57 -55 -57 -62 -62 -58 -57 -59 -58 -55 -53 -52 -52 -51 -50 -51 -51 -55 -57 -56 -57 -55 -52 -55 -58 -56 -53 -50 -51 -56 -57
4270 -57 -54 -49 -49 -49 -47 -46 -49 -51 -48 -49 -51 -52 -52 -51 -49 -50 -50 -51 -48 -46 -48 -50 -47 -45 -47 -48 -48 -49 -49 -50 -49 -48 -46 -47 -47 -48 -48 -48 -46 -45 -46 -47 -47 -47 -46 -45 -45 -45 -45 -45 -44 -44 -44 -42 -42 -44 -45 -44 -46 -47 -45 -43 -45 -45 -44 -43
4138 -43 -43 -45 -45 -44 -41 -40 -38 -39 -40 -40 -38 -41 -42 -43 -42 -40 -43 -45 -42 -39 -40 -43 -45 -43 -40 -39 -40 -40 -41 -40 -40 -40 -40 -42 -43 -40 -37 -35 -37 -36 -37 -40 -41 -38 -36 -35 -37 -37 -36 -35 -37 -39 -37 -36 -35 -36 -35 -37 -38 -36 -35 -36 -36 -33 -32
4008 -32 -35 -36 -37 -37 -36 -33 -33 -34 -35 -33 -32 -33 -33 -32 -33 -34 -33 -33 -33 -34 -31 -30 -32 -35 -36 -35 -33 -34 -34 -36 -35 -34 -33 -33 -33 -35 -37 -39 -38 -36 -34 -32 -33 -33 -33 -33 -29 -28 -30 -32 -38 -41 -39 -37 -33 -27 -30 -36 -34 -32 -35 -32 -33 -31 -29 -33 -36 -39
3872 -39 -37 -31 -32 -35 -32 -29 -29 -34 -37 -31 -26 -26 -28 -34 -36 -39 -35 -31 -30 -32 -29 -29 -30 -30 -31 -28 -28 -29 -23 -22 -23 -27 -29 -30 -35 -31 -30 -27 -25 -25 -25 -24 -25 -25 -24 -27 -26 -23 -23 -25 -26 -25 -25 -24 -25 -27 -28 -28 -28 -32 -33 -29 -31 -31
3744 -31 -21 -21 -26 -32 -29 -24 -18 -20 -22 -23 -20 -18 -18 -21 -24 -29 -28 -22 -19 -19 -19 -17 -17 -19 -21 -21 -24 -21 -16 -16 -16 -17 -20 -23 -21 -21 -23 -17 -14 -13 -14 -14 -17 -22 -22 -27 -34 -33 -23 -19 -18 -18 -16 -14 -15 -18 -23 -22 -14 -12 -16 -23
3620 -23 -25 -22 -20 -20 -20 -19 -16 -16 -16 -16 -17 -18 -19 -18 -20 -24 -21 -14 -13 -13 -13 -13 -13 -12 -14 -20 -20 -13 -13 -13 -11 -9 -12 -12 -11 -12 -15 -13 -11 -12 -13 -12 -11 -12 -13 -15 -16 -18 -16 -15 -15 -15 -13 -16 -18 -17 -16 -19 -21 -20 -20 -20 -20 -20 -21 -22 -22 -23 -24 -25 -25
3478 -25 -23 -23 -23 -24 -22 -24 -27 -27 -26 -26 -26 -25 -24 -26 -26 -25 -25 -26 -25 -25 -25 -27 -28 -26 -26 -25 -25 -27 -28 -29 -29 -26 -27 -25 -24 -25 -26 -26 -27 -28 -29 -28 -27 -27 -29 -29 -28 -28 -28 -29 -29 -27 -27 -29 -28 -28 -29 -29 -29 -30 -29 -29 -29 -29 -28 -26
$$ packed form
4400e9jkJkKL%kTJKkmJUMkmMK%jlkJKMJlTkJNJKkn%MJkJLKJ%JTj%mkJjKLlTKLTjnj
4270e7LN%TKJlkLjkj%JKj%jLKkTLKkj%j%jJTKj%j%TKJjT%TJT%VJ%TK%kjJkjKTk%JT
4138d3%k%JLJKjT%KljTJKlkLTjlkKLJj%jJ%UkjLTKkJjljLKJk%JTkTKJTjJkjKJj%LJ
4008c2ljT%JL%jTKJj%JjTJ%TjLJkljJKj%kJU%TkUJKUj%UMJkTolKTMOloKTlLjKTmlT
3872c9KOjlLT%nlON%koklMTJkL%j%jL%jOJjmkjnMJLK%TJj%JlJL%kjJ%Jjkj%TmjMk%
3744c1J0%noLNOkTjLK%lTnJOL%TK%kT%lLN%TjlTK%kOLJj%ln%npJJ0MJ%KTjlnJQKmp
3620b3kLK%TJL%UjUJkmLPJ%VJko%P%TKTl%JjlKTjTJTjTkjkKJ%TKlkJTlkJ%VjT%jU%
3478b5K%TjKkl%J%TJTk%J%jJ%TkjK%J%kjT%LjKJjT%jUJT%k%J%Tj%K%kJ%j%TjJ%UJK
$$ plain form
3346 -26 -27 -28 -27 -29 -31 -29 -28 -27 -25 -25 -27 -29 -28 -27 -25 -25 -27 -26 -24 -24 -24 -24 -25 -24 -25 -25 -25 -25 -26 -26 -25 -24 -24 -24 -25 -25 -25 -24 -25 -27 -26 -26 -25 -26 -25 -25 -24 -24 -25 -25 -25 -25 -23 -25 -25 -24 -23 -24 -25 -25 -23 -24 -28 -27 -25 -25 -24
3212 -24 -24 -24 -23 -23 -23 -23 -24 -25 -23 -23 -23 -23 -23 -23 -23 -23 -22 -21 -22 -22 -21 -20 -19 -19 -19 -18 -19 -20 -18 -16 -17 -18 -18 -18 -17 -17 -18 -18 -18 -16 -15 -14 -15 -15 -16 -17 -16 -16 -16 -15 -15 -16 -14 -13 -14 -14 -14 -13 -11 -11 -11 -10 -7 -7 -9 -10 -10 -10 -1 7 2
3070 2 -5 -7 -8 -2 19 27 10 -4 -8 -8 5 45 65 38 8 -3 -4 -1 47 120 107 43 5 -4 -7 7 100 205 165 60 7 -4 -6 2 114 288 274
2996 274 116 17 -8 -12 -13 40 264 411 256 58 -26 -47 -59 -67 14 295 436 227 27 -30 -29 -19 -15 58 346 555 369 114
2940 114 16 0 -2 0 12 170 464 460 206 49 8 1 0 -3 13 150 327 269 98 17 0 -1 -1 -1 0 0 1 2 3 4 5 4 6 7 9 58 239 334 194
2862 194 58 14 8 8 10 11 16 141 418 462 223 58 18 12 11 9 12 18 139 438 496 242 64 17 14 13 13 12 13 71 312 479 300
2796 300 90 23 13 12 12 12 15 20 123 340 351 161 44 18 15 15 15 15 15 23 112 264 240 98 30 17 15 15 15 16 17 18 67 167 167 78 27 18 16
2718 16 17 16 16 16 18 30 84 114 70 30 19 17 18 19 19 17 17 18 32 62 62 35 21 20 19 17 17 18 18 21 21 28 40 38 27 21 20 21 21 21 21 20 20 21 25 31 30 24 22 22 22 22 22 23 22
$$ packed form
3346b6jTJkTKJTK%kTJTK%kJK%UjJj%Uj%JT%Tj%TJjkJ%JjJ%J%j%UKk%JTjT%KjmJK%J
3212b4%TJ%UjTK%YJTj%JU%TJjTKTjT%TJ%j%TKJTj%jTJ%TJ%jKJj%TJK%TJL%kj%TRQn
3070BpkjOK1Qj7j4m%J3M0K0k7l0j1jLM8P3j3o4l8rlJ4R3J05m0j05n3j1kQJ12J74j4
2996B74j58r9k5mjN3K24J47j55j98q4k1j2qQ1K81J41k09k00n7JJ0MP3K88K09j86k55
2940A14r8j6kKJ2J58K94mk54j57m1pjlJ6J37J77n8j71q1j7j%TJ%JWjKJKM9J81R5j40
2862A94j36m4o%KJNJ25K77M4k39j65m0ojkLOJ21K99N8k54j78m7lj%jJN8K41J67j79
2796C00k10o7j0j%TLNJ03K17J1j90j17k6l%VQQ9J52k4j42o8j3k%TJUM9J00%q9n1rk
2718A6Jj%TKJ2N4L0m4m0j1kJT%k%JJ4L0%k7j4jTk%J%L%PJ2kj1ojJ%Uj%JMOjok%VJj
$$ plain form
2608 22 23 24 25 27 26 25 24 24 23 23 23 24 25 25 23 23 24 26 25 25 26 26 25 25 25 24 25 25 25 24 23 24 25 24 23 24 25 25 25 25 26 25 25 25 25 25 26 26 25 25 24 25 26 27 27 26 25 26 27 28 29 29 29 29 29 29 29 28 28 29 29 29 29 30 29 29 30 31
2452 31 31 32 32 32 33 32 31 30 30 31 32 32 32 31 31 32 33 33 32 31 32 32 32 31 32 32 31 31 33 33 32 33 33 33 34 37 40 46 52 57 61 69 76 79 78 81 80 73 68 63 58 57 63 70 74 78 75 67 64 63 66 63 58 55 55 52
2320 52 47 44 44 44 42 40 40 38 37 37 36 36 38 39 39 40 38 36 37 38 37 37 36 37 38 38 39 40 38 37 38 38 37 37 38 38 37 38 37 37 37 37 38 38 37 37 38 38 39 39 38 37 39 40 39 38 40 40 38 38 38 38 39 40 41 42 42 41
2184 41 41 40 40 41 41 40 41 42 41 41 40 40 40 41 41 42 41 41 41 41 42 43 42 41 41 42 42 43 42 41 41 42 42 42 42 41 41 41 42 42 42 42 42 41 42 41 40 41 41 41 41 42 42 42 42 43 42 41 41 41 41 41 41 41 41 41 40 40 40 43 43 42 42 43 43 43 43
2030 43 42 41 42 42 41 42 44 44 42 43 44 43 42 43 43 40 41 43 42 43 42 43 44 43 42 42 42 42 42 41 40 40 42 43 43 43 43 42 43 44 43 41 40 40 43 44 43 41 42 42 42 42 41 40 41 43 44 45 45 45 44 45 45 46 45 43 43 44 45
1892 45 45 45 45 43 43 44 45 45 45 45 41 39 42 45 45 44 45 46 46 45 45 44 41 40 41 43 43 44 45 45 42 43 42 42 44 47 47 46 46 45 44 44 45 44 41 40 42 40 40 39 42 45 44 44 43 41 43 42 40 38 38 38 42 43 41 42
1760 42 41 41 43 39 35 35 37 38 39 40 41 40 34 40 45 49 54 55 53 49 39 39 46 50 47 43 40 38 36 31 30 28 32 32 29 24 18 7 5 7 7 2 1 0 -4 -1 3 1 0 3 2 -3 -13 -14 -10 -15 -17 -11 -10 -13 -19 -23 -22 -21
1632 -21 -24 -27 -30 -34 -34 -32 -38 -45 -43 -41 -46 -51 -53 -54 -59 -62 -63 -65 -65 -64 -63 -63 -62 -61 -59 -56 -57 -54 -45 -40 -37 -31 -23 -18 -14 -21 -22 -10 -4 0 2 6 5 -1 -3 -1 7 12 9 12 17 17 14 14 10 11 13 14 16 17 13 3 8
$$ packed form
2608B2JUKjU%j%TJT%k%JKj%J%j%TjJ%TjTJTjTJT%UJj%VJ%j%jJU%jTJV%Xj%J%UJj%JT
2452C1%J%TJjU%JT%Tj%JT%jTJ%TjJ%j%K%jJ%TJLTOTNMQPLjLjpnUjOPMTlqljLlnl%l
2320E2nl%TkT%kj%j%KJ%JkTJTj%jJT%JTkjJ%j%J%jJj%UJ%j%J%J%jTKJjTK%k%UJV%j
2184D1%j%J%jJTj%j%TJ%Jj%UJTjT%J%JjT%J%Uj%TJ%VjJjTJ%UJ%UJjT%Zj%TL%j%J%U
2030D3jTJ%jJK%kJTjTJ%lJKjJjJTjT%VjT%KJ%UjJTjkj%LJjkJ%UjTJKJT%TjJ%Jjk%JT
1892D5%Uk%JT%UmkLT%jJT%j%jljJK%JT%lJj%KL%j%jT%JjljKk%jLTj%jkKjkT%TMJkJ
1760D2j%KmT%KJVjoONMNJkmj0%PMlmlkTnjkM%lnoj1kK%njTmLMkjLjnj0jMnkOJlomJT
1632b1lUm%KopKTnTkjnljk%JT%JTKLjLRNLOQNMpjJ2OMKMjokKQNlLN%l%mJKJKJmj0N
$$ plain form
1506 8 22 25 25 19 18 21 18 11 11 15 16 13 13 12 7 1 0 7 10 8 8 9 4 -5 -6 1 4 5 4 8 12 13 14 9 5 7 6 2 2 -1 -6 -8 -13 -19 -17 -15 -14 -13 -12 -14 -12 -11 -13 -15 -15 -14 -9 -8 -10 -10 -7 -4 -2 -4 -7
1376 -7 -9 -7 -7 -8 -11 -15 -15 -8 0 4 8 9 10 13 18 22 20 15 17 22 24 23 23 24 27 26 22 19 19 20 20 20 20 20 21 22 23 23 24 24 23 22 21 21 20 18 14 11 7 0 -11 -28 -54 -95 -153 -214 -252 -246 -199 -139
1256 -139 -83 -44 -20 -7 4 12 19 20 20 22 25 28 29 30 30 30 31 32 32 32 31 31 33 33 31 32 32 31 30 29 28 27 27 27 25 23 22 20 20 19 17 15 14 12 11 11 10 7 6 7 4 0 -5 -7 -10 -16 -22 -27 -33 -44
1136 -44 -56 -67 -75 -86 -97 -110 -122 -135 -147 -158 -167 -178 -189 -198 -210 -221 -228 -231 -237 -240 -239 -235 -232 -228 -223 -215 -206 -195 -189 -181 -172 -165 -165 -161 -157 -154 -150 -150 -153 -154 -155 -163 -168 -172 -177 -184 -190 -196 -199 -200 -201 -207
1032 -207 -207 -208 -214 -220 -219 -217 -210 -199 -179 -158 -134 -110 -89 -70 -55 -43 -36 -28 -20 -14 -12 -7 -2 0 2 3 5 9 9 8 12 15 16 17 16 17 19 20 22 23 22 23 23 22 23 25 26 25 23 22 24 24 25 25 26 27 28 29
916 29 29 27 28 29 29 30 30 30 30 31 29 26 23 21 17 14 10 8 5 0 -5 -7 -9 -11 -14 -15 -16 -16 -15 -14 -12 -11 -10 -8 -8 -7 -5 -5 -12 -21 -29 -37 -48 -65 -84 -105 -126 -144 -159 -176 -189 -208 -225 -247 -270
806 -270 -294 -304 -302 -282 -261 -237 -207 -177 -151 -123 -98 -81 -67 -56 -47 -39 -31 -25 -18 -15 -15 -13 -8 -5 -4 -7 -7 -4 0 1 0 -1 -1 -3 0 7 7 1 2 5 5 5 7 7 2 -1 -2 -4 -9 -13 -16 -14 -12
700 -12 -12 -15 -11 -8 -7 -8 -4 -3 -5 -7 -8 -5 -2 1 8 15 8 -4 -16 -16 -7 4 8 7 0 -2 3 8 6 6 14 13 5 8 12 11 5 2 2 3 -2 -3 4 4 4 3 13 16 12 11 15 5 -1 1 9 16 18 25 20 10 14
$$ packed form
1506HJ4L%ojLlp%MJl%jnojPLk%JnrjPLJjMTJTnmKjm%lnknoKTJUkKJkT%JNJk%LTKkl
1376gkK%jlm%PQMTJTLNMknKNKj%JLjml%J%VJU%J%jU%jkmlmpj1j7k6m1n8o1l8OM7O0
1256a39N6L9K4J3J1QPJ%KLTJT%TJT%Tj%K%kJ%jW%TkTjk%jkTjkj%jljJlmnkloTnoj1
1136d4j2j1qj1Tj3j2j3j2j1rj1Trj2j1plolJMLMNQRJ1OQRP%MTLM%ljTqnmnpoTljTo
1032b07%joTJKPJ1K0K1K4TK1J9J5J2PQTOKNTKTJKM%jMLJTjJKJKJjJ%jJKJjkjK%J%JV
916B9%kJT%J%UJklTkmlmklnTkUljT%JTKJTK%JK%prqTj1j7j9k1Tj8j5j7j3j9j7k2k3
806b70k4j0KK0K1K4L0TK6K8K5J7J4J1RQTOPL%KNLJl%LMJjT%kLP%oJL%TK%nljknmlKT
700a2%lMLJjMJkTjLUPTpj2T%RJ1MjpkNTk%QjqLMjol%JnjP%TjJ0LmjMj0oKQPKPnj0M
$$ plain form
578 14 4 8 11 -3 -22 -35 -21 -1 19 51 77 57 26 -31 -60 -16 49 55 -8 -72 -33 37 153 208 155 149 172 184 72 -126 -57 69 10
512 10 -130 -178 -167 2 185 291 294 194 448 699 -173 144 595 2364 597 -2308 1781 -2738 -321 1153 -1841
470 -1841 1943 239 315 -17 -486 2713 -722 1401 -1084 575
$$ packed form
578A4j0MLj4j9j3J4K0TL2K6k0l1n7k9M4O5Oo3o4L9P0J16N5n3oK3J2j12j98O9J26n9
512A0j40m8J1J69J83J06Lj00K54K51q72L17M51J769j767k905M089m519K417J474k994
470a841L784j704P6l32m69L199l435K123k485J659
450E75
##END=
