##TITLE= CO2
##JCAMP-DX= 4.24  $$a comment
##ORIGIN= PERKIN-ELMER 1600 FT-IR
##DATA TYPE= INFRARED SPECTRUM
##$ASDF FORM= DUP
##DATE= 96/06/14
##TIME= 08:31:15
##OWNER= Scott Van Bramer
##JCAMP-DX= 4.24     $$ a comment
##ORIGIN= PERKIN-ELMER 1600 FT-IR
##DATA TYPE= INFRARED SPECTRUM
##$ASDF FORM= DUP
##SPECTROMETER/DATA SYSTEM= PERKIN-ELMER 1600 FTIR
##INSTRUMENT PARAMETERS= 
svbco2: 4400.0,450.00 cm-1; -0.13,0.35 A        96/06/14 08:31
   256 scans; mode ratio; resol 4.00 cm-1; apod strong
##DATA PROCESSING= 
##XUNITS= 1/CM
##YUNITS= ABSORBANCE
##XFACTOR= 1.
##YFACTOR= 0.00028
##FIRSTX= 4400.
##LASTX= 450.
##NPOINTS= 1976
##MAXY= 1
##MINY= -0.02
##FIRSTY= 0.0001
##XYDATA= (X++(Y..Y))
4400 1 2 3 3 2 4 3 3 4 4 4 4 5 5 5 4 3 4 4 3 4 4 4 3 4 5 5 3 3 5 4 2 2 2 3 3 4 5 6 5 4 3 4 5 4 3 3 3 4 4 3 3 3 2 3 5 4 1 2 4 5 4 4 4 4 5 4 4 4 4 2
4260 2 2 3 4 5 4 4 4 4 5 5 4 3 3 3 2 4 4 4 4 4 4 4 4 3 2 3 4 4 5 5 4 4 4 4 3 1 2 2 3 4 4 4 4 3 4 2 1 2 4 3 3 3 2 2 4 4 5 4 4 4 4 2 2 3 4 3 2 3 3 2 3 3 3 3 3 3 3 3 4 4
4100 4 5 6 5 4 4 4 4 4 5 6 5 4 4 3 3 3 4 3 4 4 4 4 4 4 5 4 3 4 4 4 4 4 5 5 5 4 4 4 3 2 3 4 4 4 3 4 3 3 3 3 2 3 4 4 4 4 4 5 6 5 5 5 4 4 5 5 5 5 5 6 5 5 5 5 5 4 3 3 3 3
3940 3 4 3 3 4 5 5 6 6 5 4 4 6 7 7 5 4 3 1 -2 -2 2 3 3 3 3 3 2 2 3 4 3 2 2 2 1 0 -2 -2 0 2 2 1 -2 -3 -1 0 0 -2 -4 -7 -11 -9 -4 -2 0 3 4 1 -3 -3 -1 -3 -3 0 0 -1 -1 -1
3804 -1 -2 -1 0 0 2 4 4 4 4 3 3 2 2 2 2 1 0 1 2 2 2 1 2 7 13 23 60 110 155 216 258 301 349 386 392 411 444 454 443 416 388 353 313 267 254 300 361
3710 361 373 368 357 326 303 295 285 272 253 199 156 156 154 145 135 123 105 73 58 47 40 37 33 28 25 22 21 21 22 25 42 75 107 135 161 185 211 242 263
3632 263 273 284 299 293 254 194 183 184 154 141 181 242 266 267 279 289 276 277 294 281 244 207 184 167 144 121 109 110 111 107 104 108 104 89 73 58 49 43 38
3554 38 32 26 21 16 12 7 3 2 -1 -6 -9 -11 -12 -12 -12 -12 -13 -13 -13 -13 -14 -16 -18 -17 -16 -17 -19 -21 -21 -22 -24 -25 -23 -22 -22 -23 -25 -25 -26 -26 -26 -26 -27 -26 -26 -25 -26 -26 -27 -28 -29 -29 -28 -26 -26 -26 -27 -28 -29 -29 -29 -29 -29 -28 -28 -29 -29 -28 -28 -28 -28 -28 -30
3408 -30 -29 -28 -28 -29 -29 -28 -27 -27 -27 -27 -27 -27 -27 -27 -27 -27 -25 -25 -25 -25 -25 -25 -25 -25 -24 -24 -24 -24 -25 -25 -24 -23 -23 -22 -22 -22 -21 -21 -21 -21 -21 -22 -21 -20 -20 -20 -19 -19 -19 -19 -18 -19 -19 -19 -18 -18 -18 -18 -18 -16 -16 -16 -16 -16 -15 -15 -16 -18 -18 -17 -17 -16 -16 -16 -15 -15 -15 -14 -15 -15 -15 -15 -15 -14 -13 -13 -13 -13 -13 -13 -13 -13 -13
3222 -13 -11 -11 -11 -11 -11 -10 -11 -11 -11 -10 -10 -11 -11 -9 -9 -8 -8 -9 -10 -9 -9 -9 -8 -9 -9 -9 -8 -8 -8 -8 -8 -8 -7 -7 -7 -7 -8 -7 -6 -6 -6 -7 -6 -6 -6 -6 -7 -6 -5 -5 -5 -4 -5 -6 -6 -5 -6 -5 -4 -4 -4 -4 -4 -3 -2 -2 -3 -4 -4 -4 -3 -4 -4 -4 -4
3072 -4 -3 -3 -3 -3 -3 -3 -3 -2 -2 -2 -1 -1 -2 -3 -3 -2 -1 -2 -2 -2 -2 -2 -2 -2 -2 -2 -2 -2 -2 -2 -1 -2 -2 -1 -2 -1 -1 -1 -1 -1 -1 -1 -1 -1 -2 -2 -3 -3 -2 -2 -3 -4 -4 -5 -4 -3 -2 -2 -1 -1 -1 -1 -1 0 0 -1 -1 -1 0 0 0 0 1 0 0 0 0 1 0 0 -1 0 0 0 0 0 1 1 0 0 0 0 0
2886 0 1 0 0 0 1 1 1 1 1 0 0 0 0 0 1 1 2 1 0 0 1 0 1 1 1 0 1 2 2 2 2 1 1 1 1 1 1 2 1 1 1 1 1 1 1 1 1 1 1 1 0 0 0 0 0 1 1 1 2 2 2 1 0 1 1 2 2 1 1 1 1 1 1 1 1 1 0 1 1 1 0 1 0 0 0 1 1 0 1
2708 1 1 1 1 2 1 1 1 1 1 2 2 1 1 2 2 1 0 1 0 1 1 1 1 2 1 2 1 1 1 2 1 1 1 1 1 1 0 0 0 1 1 1 1 2 2 1 1 1 2 1 1 0 0 1 1 1 1 1 1 1 1 1 0 0 1 1 0 0 1 1 1 2 2 2 2 2 2 2 2 2 2 3 3 4 3 3 3 3
2532 3 2 2 2 3 3 3 3 3 2 2 2 2 3 2 2 2 3 3 2 2 2 1 2 2 2 2 1 1 1 1 1 1 1 1 2 1 1 0 0 1 0 1 1 1 1 1 1 1 1 1 1 1 1 1 1 0 0 1 1 1 1 1 0 1 1 1 1 1 5 18 56 130 232 349 468 583 718
2378 718 903 1167 1507 1905 2320 2720 3061 3299 3450 3490 3327 3042 2721 2431 2370 2650 3033 3118 3078 3144 3148 2974 2849 2694
2330 2694 2463 2311 2318 2238 2032 1800 1619 1576 1650 1667 1541 1331 1178 1137 1087 1000 945 884 790 694 600 494 393 352 355 343 319
2276 319 293 271 258 254 253 249 238 222 210 200 185 166 148 129 112 96 80 66 54 43 33 25 19 14 10 7 5 4 3 2 1 0 0 0 0 0 -1 -2 -2 -2 -2 -2 -2 -2 -2 -3 -3 -3 -3 -3 -2 -2 -2 -3 -2 -2 -2 -2 -2 -3
2156 -3 -3 -3 -3 -3 -3 -2 -2 -2 -3 -3 -2 -1 0 0 -1 0 -1 -1 0 -1 -1 0 0 0 0 0 0 1 1 1 2 2 1 1 1 2 2 7 20 19 6 1 2 3 5 6 7 7 7 6 5 5 4 3 3 2 1 0 0 0 0 0 0 0 1 1 1 0 0 0 0 0 1 1 0 0 0 0 0 0 0 0 0 0 0
1986 0 1 1 0 1 1 1 0 0 0 0 0 0 -1 -1 -1 0 0 0 -1 0 0 0 -1 0 0 1 1 0 0 1 1 0 0 -1 0 2 2 1 1 1 0 0 1 2 2 1 1 -2 -1 0 1 0 1 0 0 0 0 -1 -1 0 1 1 1 1 1 0 0 1 1 -1 -2 -1 0
1840 0 0 1 2 1 -2 -2 -2 -2 0 0 1 0 0 -1 0 2 2 0 -2 -3 0 2 -1 -4 -2 0 0 -1 -1 -1 -1 -3 -7 -9 -6 -3 -2 -2 -4 -4 -4 -4 -3 -4 -5 -4 -3 -5 -7 -8 -5 -5 -8 -7 -5 -4 -4 -4 -4 -6 -13 -14 -7 -5 -5 -6 -7 -9 -9
1702 -9 -12 -13 -12 -9 -7 -7 -9 -12 -15 -11 -8 -8 -12 -14 -13 -13 -11 -10 -12 -13 -10 -9 -12 -17 -17 -16 -18 -18 -13 -10 -9 -10 -14 -13 -10 -7 -8 -8 -10 -8 -7 -9 -11 -7 -5 -4 -3 -4 -3 -2 -2 -2 -3 -3 -3 -2 -2 -2 -2 -2 -3 -5 -8 -6 -5 -8 -7
1568 -7 -5 -6 -6 -10 -17 -11 -9 -6 -5 -5 -6 -9 -16 -19 -10 -7 -8 -7 -5 -8 -11 -11 -16 -16 -12 -11 -7 -6 -7 -11 -15 -10 -7 -7 -11 -11 -8 -7 -9 -8 -5 -4 -3 -3 -4 -7 -12 -12 -5 -3 -5 -5 -4 -5 -12 -11 -5 -2 -2 -3 -1 0 0 -1 -2
1438 -2 -2 1 0 -2 -1 0 -2 -3 -5 -5 -3 -2 0 0 0 -2 -3 -2 -4 -4 -5 -4 -2 -2 -3 -3 -3 -3 -2 -4 -6 -6 -6 -6 -3 0 3 3 4 5 4 2 1 0 0 -1 -1 -2 -1 -1 -2 -1 -2 -2 -2 -2 -1 -1 -1 -1 -2 -1 -1 -2 -2 -2 -2 -2 -2 -2 -2 -3 -3 -3 -3 -3 -3 -2
1282 -2 -3 -3 -3 -3 -3 -4 -6 -8 -9 -12 -13 -12 -9 -6 -5 -4 -4 -3 -2 -2 -2 -2 -2 -2 -2 -2 -3 -4 -3 -3 -3 -3 -3 -3 -3 -3 -3 -2 -3 -3 -3 -2 -3 -2 -2 -2 -2 -1 -2 -3 -3 -2 -2 -3 -3 -3 -3 -3 -4 -4 -3 -4 -4 -4 -3 -3 -3 -4 -4 -4 -4 -4 -4 -5 -6 -6 -6 -6 -7 -7 -7 -7 -7 -9 -11 -11 -11
1108 -11 -10 -9 -9 -10 -11 -12 -12 -11 -10 -10 -11 -11 -11 -11 -9 -9 -9 -9 -9 -9 -9 -8 -7 -8 -9 -9 -8 -8 -8 -7 -7 -8 -9 -9 -9 -9 -9 -10 -10 -10 -11 -12 -12 -12 -11 -10 -9 -7 -7 -5 -4 -4 -5 -4 -3 -2 -2 -2 -2 -2 -2 -2 -1 -1 -1 -1 -1 -1 0 0 1 0 -1 -2 -2 -1 -1 0 -1 -1 -1 -1 -2
942 -2 -2 -2 -2 -2 -1 -2 -3 -4 -4 -3 -3 -3 -3 -4 -3 -3 -3 -3 -2 -3 -4 -4 -4 -4 -4 -4 -4 -5 -6 -6 -6 -6 -6 -5 -5 -5 -6 -6 -9 -8 -5 -4 -6 -7 -5 -6 -8 -7 -6 -6 -7 -7 -7 -8 -9 -9 -9 -10 -11 -10 -11 -12 -13 -14 -15 -14 -12 -12 -14 -15 -17 -16 -14 -12 -9 -9 -9 -9 -9 -7 -5 -6 -7
776 -7 -6 -5 -5 -5 -3 0 0 3 5 7 10 15 20 27 31 47 78 81 64 62 63 61 55 50 40 42 297 564 311 101 100 130 151 178 206 245 277 316 356 406 448 499 548
690 548 561 570 630 677 709 725 731 727 945 1682 1627 637 602 697 646 645 647 643 663 859 863 578 435 410 383 352 305 269 235 199 161 126 95
624 95 54 165 471 375 88 39 47 48 49 48 45 47 58 54 28 21 10 -1 -6 -5 -6 -5 -8 -12 -11 -7 -13 -17 -17 -10 2 -2 -3 2 19 14 -8 -2 26 8 -7 -36 -15 -5
536 -5 16 53 27 -57 -71 -86 -115 -50 12 -79 -132 -69 11 154 249 448 572 679 335 479 105 -328 -531 10 953 2498 -67
482 -67 -1264 470 -999 1279 -866 -210 225 -171 -702 621 -1130 728 -395 -229 -324 -488
450d88
##END=
